Proxmark3 developers community

Research, development and trades concerning the powerful Proxmark3 device.

Remember; sharing is caring. Bring something back to the community.


"Learn the tools of the trade the hard way." +Fravia

You are not logged in.

#1 2020-02-14 20:58:09

Winds
Banned
Registered: 2020-01-28
Posts: 53

ProxSpace Bug

Hi, please fix:

/bin/sh: D:/mingwbuild/mingw-w64-qt5/pkg/mingw-w64-x86_64-qt5/mingw64/bin/uic: No such file or directory
===================================================================
Platform name:     Proxmark3 rdv4
PLATFORM:          PM3RDV4
Platform extras:   No extra selected
Included options:  SMARTCARD FLASH -DRDV4 LF HITAG ISO15693 LEGICRF ISO14443b ISO14443a ICLASS FELICA NFCBARCODE HFSNIFF HFPLOT
Standalone mode:   LF_SAMYRUN
===================================================================
[*] MAKE client/clean
[!] Platform definitions changed, cleaning bootrom/armsrc/recovery first...
[*] MAKE bootrom/clean
[*] MAKE fpga_compress/clean
[*] MAKE armsrc/clean
[*] MAKE recovery/clean
[*] MAKE mfkey/clean
[*] MAKE nonce2key/clean

===================================================================
Platform name:     Proxmark3 rdv4
PLATFORM:          PM3RDV4
Platform extras:   No extra selected
Included options:  SMARTCARD FLASH -DRDV4 LF HITAG ISO15693 LEGICRF ISO14443b ISO14443a ICLASS FELICA NFCBARCODE HFSNIFF HFPLOT
Standalone mode:   LF_SAMYRUN
===================================================================
[*] MAKE client/all
[-] CC proxmark3.c
[-] CC uart/uart_posix.c
[-] CC uart/uart_win32.c
[-] CC ui.c
[-] CC ../common/commonutil.c
[-] CC util.c
[-] CC ../common/util_posix.c
[-] CC scandir.c
[-] CC ../common/crc16.c
[-] CC comms.c
[-] CC ../common/crapto1/crapto1.c
[-] CC ../common/crapto1/crypto1.c
[-] CC mifare/mifaredefault.c
[-] CC mifare/mfkey.c
[-] CC tea.c
[-] CC fido/additional_ca.c
[-] CC fido/cose.c
[-] CC fido/cbortools.c
[-] CC fido/fidocore.c
[-] CC crypto/asn1dump.c
[-] CC crypto/libpcrypto.c
[-] CC crypto/asn1utils.c
[-] CC cliparser/argtable3.c
[-] CC cliparser/cliparser.c
[-] CC loclass/cipher.c
[-] CC loclass/cipherutils.c
[-] CC loclass/ikeys.c
[-] CC loclass/elite_crack.c
[-] CC fileutils.c
[-] CC whereami.c
[-] CC mifare/mifarehost.c
[-] CC ../common/parity.c
[-] CC ../common/crc.c
[-] CC ../common/crc64.c
[-] CC ../common/legic_prng.c
[-] CC ../common/iso15693tools.c
[-] CC prng.c
[-] CC ../common/generator.c
[-] CC graph.c
[-] CC cmddata.c
[-] CC ../common/lfdemod.c
[-] CC emv/crypto_polarssl.c
[-] CC emv/crypto.c
[-] CC emv/emv_pk.c
[-] CC emv/emv_pki.c
[-] CC emv/emv_pki_priv.c
[-] CC emv/test/cryptotest.c
[-] CC emv/apduinfo.c
[-] CC emv/dump.c
[-] CC emv/tlv.c
[-] CC emv/emv_tags.c
[-] CC emv/dol.c
[-] CC emv/emvjson.c
[-] CC emv/emvcore.c
[-] CC emv/test/crypto_test.c
[-] CC emv/test/sda_test.c
[-] CC emv/test/dda_test.c
[-] CC emv/test/cda_test.c
[-] CC emv/cmdemv.c
[-] CC emv/emv_roca.c
[-] CC mifare/mifare4.c
[-] CC mifare/mad.c
[-] CC mifare/ndef.c
[-] CC cmdanalyse.c
[-] CC cmdhf.c
[-] CC cmdhflist.c
[-] CC aidsearch.c
[-] CC cmdhf14a.c
[-] CC cmdhf14b.c
[-] CC cmdhf15.c
[-] CC cmdhfepa.c
[-] CC cmdhflegic.c
[-] CC cmdhficlass.c
[-] CC cmdhfmf.c
[-] CC cmdhfmfu.c
[-] CC cmdhfmfp.c
[-] CC cmdhfmfhard.c
[-] CC hardnested/hardnested_bruteforce.c
[-] CC cmdhfmfdes.c
[-] CC cmdhftopaz.c
[-] CC cmdhffido.c
[-] CC cmdhffelica.c
[-] CC cmdhfthinfilm.c
[-] CC cmdhflto.c
[-] CC cmdhw.c
[-] CC cmdlf.c
[-] CC cmdlfawid.c
[-] CC cmdlfcotag.c
[-] CC cmdlfem4x.c
[-] CC cmdlffdx.c
[-] CC cmdlfguard.c
[-] CC cmdlfgallagher.c
[-] CC cmdlfhid.c
[-] CC cmdlfhitag.c
[-] CC cmdlfio.c
[-] CC cmdlfindala.c
[-] CC cmdlfjablotron.c
[-] CC cmdlfkeri.c
[-] CC cmdlfnexwatch.c
[-] CC cmdlfnedap.c
[-] CC cmdlfnoralsy.c
[-] CC cmdlfpac.c
[-] CC cmdlfparadox.c
[-] CC cmdlfpcf7931.c
[-] CC cmdlfpresco.c
[-] CC cmdlfpyramid.c
[-] CC cmdlfsecurakey.c
[-] CC cmdlft55xx.c
[-] CC cmdlfti.c
[-] CC cmdlfviking.c
[-] CC cmdlfvisa2000.c
[-] CC cmdlfmotorola.c
[-] CC cmdtrace.c
[-] CC cmdflashmem.c
[-] CC cmdflashmemspiffs.c
[-] CC cmdsmartcard.c
[-] CC cmdusart.c
[-] CC cmdwiegand.c
[-] CC cmdparser.c
[-] CC cmdmain.c
[-] CC pm3_binlib.c
[-] CC scripting.c
[-] CC cmdscript.c
[-] CC pm3_bitlib.c
[-] CC cmdcrc.c
[-] CC ../common/bucketsort.c
[-] CC flash.c
[-] CC wiegand_formats.c
[-] CC wiegand_formatutils.c
[-] UIC ui/ui_overlays.h
/bin/sh: D:/mingwbuild/mingw-w64-qt5/pkg/mingw-w64-x86_64-qt5/mingw64/bin/uic: No such file or directory
make[1]: *** [Makefile:317: ui/ui_overlays.h] Error 127
make: *** [Makefile:98: client/all] Error 2
pm3 /c/Proxmark/ProxSpace/proxmark3$

Offline

#2 2020-02-14 21:20:52

gator96100
Contributor
From: Austria
Registered: 2016-03-25
Posts: 153

Re: ProxSpace Bug

Please send the output of the ps-info command


modhex(hligicighgidilhkfchihtijduhbif)

Offline

#3 2020-02-14 21:22:37

Winds
Banned
Registered: 2020-01-28
Posts: 53

Re: ProxSpace Bug

gator96100 wrote:

Please send the output of the ps-info command

There you go

ProxSpace info:
Version: 3.3
Arch: x86_64
OS: Microsoft Windows 10 Pro              64-bit          10.0.18362
CPU: Intel(R) Core(TM) i5-4210U CPU @ 1.70GHz
Ram: 8481255424
cat: /ps/installed32.txt: No such file or directory
Installed32:
Installed64: 2020-02-14 21:47:18
OLDPWD: /c/Proxmark/ProxSpace/ProxSpace
Path: /gcc-arm-none-eabi/bin:/ps/bin:/mingw64/bin:/usr/local/bin:/usr/bin:/bin:/c/Windows/System32:/c/Windows:/c/Windows/System32/Wbem:/c/Windows/System32/WindowsPowerShell/v1.0/:/usr/bin/site_perl:/usr/bin/vendor_perl:/usr/bin/core_perl
arm-none-eabi-gcc: 8.3.1
gcc: 9.2.0
git: git version 2.25.0
make: GNU Make 4.3
Built for i686-pc-msys
Copyright (C) 1988-2020 Free Software Foundation, Inc.
License GPLv3+: GNU GPL version 3 or later <http://gnu.org/licenses/gpl.html>
This is free software: you are free to change and redistribute it.
There is NO WARRANTY, to the extent permitted by law.
pkg-config: 0.29.2
Qt: QMake version 3.1
Using Qt version 5.14.1 in C:/Proxmark/ProxSpace/ProxSpace/msys2/mingw64/lib

Offline

#4 2020-02-14 23:02:54

gator96100
Contributor
From: Austria
Registered: 2016-03-25
Posts: 153

Re: ProxSpace Bug

This seems to be a bug from the mingw-w64-qt5 package. “D:/mingwbuild/mingw-w64-qt5/pkg/mingw-w64-x86_64-qt5” is hardcoded into the QT5 exes.
Probably due to the new relocatable feature (https://www.qt.io/blog/qt-is-relocatable). This could mean ProxSpace will be relocatable again.

For now downgrade to qt5-5.13.2:

pacman --noconfirm -R mingw-w64-x86_64-qt5
wget http://repo.msys2.org/mingw/x86_64/mingw-w64-x86_64-qt5-5.13.2-1-any.pkg.tar.xz
wget http://repo.msys2.org/mingw/x86_64/mingw-w64-x86_64-qt5-5.13.2-1-any.pkg.tar.xz.sig
pacman -U mingw-w64-x86_64-qt5-5.13.2-1-any.pkg.tar.xz

I have created an issue on the mingw-w64-qt5 package GitHub page, if there is no bug fix the next days I will create a temporary fix for ProxSpace.


modhex(hligicighgidilhkfchihtijduhbif)

Offline

#5 2020-02-15 20:26:11

Winds
Banned
Registered: 2020-01-28
Posts: 53

Re: ProxSpace Bug

I have created an issue on the mingw-w64-qt5 package GitHub page

Nice.

Offline

#6 2020-02-19 21:01:07

gator96100
Contributor
From: Austria
Registered: 2016-03-25
Posts: 153

Re: ProxSpace Bug

This bug was fixed in QT5-5.14.1-3, to upgrade an existing ProxSpace environment you can use the ps-upgrade command.


modhex(hligicighgidilhkfchihtijduhbif)

Offline

#7 2020-02-23 13:37:25

Winds
Banned
Registered: 2020-01-28
Posts: 53

Re: ProxSpace Bug

The QT bug has gone. That's I have at the moment:

Processing: common-32
Already up to date.
make: *** No rule to make target 'clean'.  Stop.
make: *** No rule to make target 'all'.  Stop.
Processing: common_arm-32
Already up to date.
make: *** No rule to make target 'clean'.  Stop.
make: *** No rule to make target 'all'.  Stop.
Processing: common_fpga-32
Already up to date.
make: *** No rule to make target 'clean'.  Stop.
make: *** No rule to make target 'all'.  Stop.
Processing: doc-32
Already up to date.
make: *** No rule to make target 'clean'.  Stop.
make: *** No rule to make target 'all'.  Stop.
Processing: driver-32
Already up to date.
make: *** No rule to make target 'clean'.  Stop.
make: *** No rule to make target 'all'.  Stop.
Processing: fpga-32
Already up to date.
rm -f *.bgn *.drc *.ncd *.ngd *_par.xrpt *-placed.* *-placed_pad.* *_usage.xml xst_hf.srp xst_lf.srp
rm -f *.map *.ngc *.xrpt *.pcf *.rbt *.bld *.mrp *.ngm *.unroutes *_summary.xml netlist.lst
rm -rf *_auto_* xst
[-] XST fpga_lf.ngc
rm -f fpga_lf.ngc
xst -ifn xst_lf.scr
make: xst: No such file or directory
make: *** [Makefile:23: fpga_lf.ngc] Error 127
Processing: include-32
Already up to date.
make: *** No rule to make target 'clean'.  Stop.
make: *** No rule to make target 'all'.  Stop.
Processing: recovery-32
Already up to date.
[=] GEN bootrom.bin
[=] GEN fullimage.bin
[=] GEN proxmark3_recovery.bin
cp: cannot stat '/mingw32/bin/libicudt64.dll': No such file or directory
cp: cannot stat '/mingw32/bin/libicuin64.dll': No such file or directory
cp: cannot stat '/mingw32/bin/libicuuc64.dll': No such file or directory
cp: cannot stat '/pm3/recovery/client/proxmark3.exe': No such file or directory
cp: cannot stat '/pm3/recovery/client/flasher.exe': No such file or directory
cp: cannot stat '/pm3/recovery/client/*.dic': No such file or directory
cp: cannot stat '/pm3/recovery/client/lualibs': No such file or directory
cp: cannot stat '/pm3/recovery/client/scripts': No such file or directory
cp: cannot stat '/pm3/recovery/client/hardnested': No such file or directory
cp: cannot stat '/pm3/recovery/armsrc/obj/fullimage.elf': No such file or directory
cp: cannot stat '/pm3/recovery/armsrc/obj/fullimage.s19': No such file or directory
cp: cannot stat '/pm3/recovery/bootrom/obj/bootrom.elf': No such file or directory
cp: cannot stat '/pm3/recovery/bootrom/obj/bootrom.s19': No such file or directory
cp: cannot stat '/pm3/recovery/recovery/bootrom.bin': No such file or directory
cp: cannot stat '/pm3/recovery/recovery/fullimage.bin': No such file or directory
cp: cannot stat '/pm3/recovery/recovery/proxmark3_recovery.bin': No such file or directory
cp: cannot stat '/pm3/recovery/driver/proxmark3.inf': No such file or directory
rm: cannot remove '/tmp/recovery/win32/hardnested/*.h': No such file or directory
rm: cannot remove '/tmp/recovery/win32/hardnested/*.c': No such file or directory
  adding: firmware_win/ (stored 0%)
  adding: firmware_win/bootrom/ (stored 0%)
  adding: firmware_win/JTAG Only/ (stored 0%)
  adding: win32/ (stored 0%)
  adding: win32/FLASH - All.bat (deflated 83%)
  adding: win32/FLASH - Bootrom.bat (deflated 85%)
  adding: win32/FLASH - fullimage.bat (deflated 83%)
  adding: win32/Go.bat (stored 0%)
  adding: win32/libbz2-1.dll (deflated 56%)
  adding: win32/libdouble-conversion.dll (deflated 52%)
  adding: win32/libFLAC-8.dll (deflated 54%)
  adding: win32/libfreetype-6.dll (deflated 49%)
  adding: win32/libgcc_s_dw2-1.dll (deflated 58%)
  adding: win32/libglib-2.0-0.dll (deflated 61%)
  adding: win32/libgraphite2.dll (deflated 51%)
  adding: win32/libharfbuzz-0.dll (deflated 56%)
  adding: win32/libiconv-2.dll (deflated 28%)
  adding: win32/libintl-8.dll (deflated 54%)
  adding: win32/libogg-0.dll (deflated 44%)
  adding: win32/libpcre-1.dll (deflated 66%)
  adding: win32/libpcre2-16-0.dll (deflated 65%)
  adding: win32/libpng16-16.dll (deflated 51%)
  adding: win32/libreadline8.dll (deflated 53%)
  adding: win32/libsndfile-1.dll (deflated 60%)
  adding: win32/libspeex-1.dll (deflated 48%)
  adding: win32/libstdc++-6.dll (deflated 69%)
  adding: win32/libtermcap-0.dll (deflated 58%)
  adding: win32/libvorbis-0.dll (deflated 46%)
  adding: win32/libvorbisenc-2.dll (deflated 83%)
  adding: win32/libwinpthread-1.dll (deflated 57%)
  adding: win32/platforms/ (stored 0%)
  adding: win32/platforms/qwindows.dll (deflated 69%)
  adding: win32/qt.conf (stored 0%)
  adding: win32/Qt5Core.dll (deflated 63%)
  adding: win32/Qt5Gui.dll (deflated 65%)
  adding: win32/Qt5Widgets.dll (deflated 65%)
  adding: win32/zlib1.dll (deflated 48%)
  adding: Windows Driver/ (stored 0%)
done
Processing: tools-32
Already up to date.
make: *** No rule to make target 'clean'.  Stop.
make: *** No rule to make target 'all'.  Stop.
Processing: traces-32
(36/36) checking keys in keyring                                         [#######################################] 100%
(36/36) checking package integrity                                       [#######################################] 100%
(36/36) loading package files                                            [#######################################] 100%
(36/36) checking for file conflicts                                      [#######################################] 100%
(36/36) checking available disk space                                    [#######################################] 100%
:: Processing package changes...
( 1/36) installing expat                                                 [#######################################] 100%
( 2/36) installing vim                                                   [#######################################] 100%
( 3/36) installing heimdal                                               [#######################################] 100%
( 4/36) installing openssh                                               [#######################################] 100%
( 5/36) installing db                                                    [#######################################] 100%
( 6/36) installing libgdbm                                               [#######################################] 100%
( 7/36) installing gdbm                                                  [#######################################] 100%
( 8/36) upgrading bash                                                   [#######################################] 100%
( 9/36) installing perl                                                  [#######################################] 100%
(10/36) installing perl-Error                                            [#######################################] 100%
(11/36) installing perl-Authen-SASL                                      [#######################################] 100%
(12/36) installing perl-Encode-Locale                                    [#######################################] 100%
(13/36) installing perl-HTTP-Date                                        [#######################################] 100%
(14/36) installing perl-File-Listing                                     [#######################################] 100%
(15/36) installing perl-HTML-Tagset                                      [#######################################] 100%
(16/36) installing perl-HTML-Parser                                      [#######################################] 100%
(17/36) installing perl-LWP-MediaTypes                                   [#######################################] 100%
(18/36) installing perl-URI                                              [#######################################] 100%
(19/36) installing perl-HTTP-Message                                     [#######################################] 100%
(20/36) installing perl-HTTP-Cookies                                     [#######################################] 100%
(21/36) installing perl-HTTP-Daemon                                      [#######################################] 100%
(22/36) installing perl-HTTP-Negotiate                                   [#######################################] 100%
(23/36) installing perl-Net-HTTP                                         [#######################################] 100%
(24/36) installing perl-WWW-RobotRules                                   [#######################################] 100%
(25/36) installing perl-Try-Tiny                                         [#######################################] 100%
(26/36) installing perl-libwww                                           [#######################################] 100%
Optional dependencies for perl-libwww
    perl-LWP-Protocol-https: for https:// url schemes
(27/36) installing perl-TimeDate                                         [#######################################] 100%
(28/36) installing perl-MailTools                                        [#######################################] 100%
(29/36) installing perl-IO-stringy                                       [#######################################] 100%
(30/36) installing perl-Convert-BinHex                                   [#######################################] 100%
module test... pass.
(31/36) installing perl-MIME-tools                                       [#######################################] 100%
(32/36) installing perl-Net-SSLeay                                       [#######################################] 100%
(33/36) installing perl-IO-Socket-SSL                                    [#######################################] 100%
(34/36) installing perl-Net-SMTP-SSL                                     [#######################################] 100%
(35/36) installing perl-TermReadKey                                      [#######################################] 100%
(36/36) installing git                                                   [#######################################] 100%
Optional dependencies for git
    python2: various helper scripts
    subversion: git svn
      1 [main] bash 1736 child_copy: data read copy failed, 0x4C2000..0x4C68E0, done 4096, windows pid 13736, Win32 error 299
/ps/bin/ps-setup: line 1:  1736 Segmentation fault      (core dumped) pacman -Q $1 > /dev/null
      0 [main] bash 1737 child_copy: data read copy failed, 0x4C2000..0x4C68E0, done 4096, windows pid 13244, Win32 error 299
/ps/bin/ps-setup: line 1:  1737 Segmentation fault      (core dumped) pacman -Q $1 > /dev/null
      0 [main] bash 1738 child_copy: data read copy failed, 0x4C2000..0x4C68E0, done 4096, windows pid 14456, Win32 error 299
/ps/bin/ps-setup: line 1:  1738 Segmentation fault      (core dumped) pacman -Q $1 > /dev/null
      0 [main] bash 1739 child_copy: data read copy failed, 0x4C2000..0x4C68E0, done 4096, windows pid 6052, Win32 error 299
/ps/bin/ps-setup: line 13:  1739 Segmentation fault      (core dumped) rm -rf /mingw64/share/qt5/examples
      0 [main] bash 1740 child_copy: data read copy failed, 0x4C2000..0x4C68E0, done 4096, windows pid 7596, Win32 error 299
/ps/bin/ps-setup: line 13:  1740 Segmentation fault      (core dumped) pacman --noconfirm --overwrite='*' -Scc
      1 [main] bash 1741 child_copy: data read copy failed, 0x4C2000..0x4C68E0, done 4096, windows pid 5404, Win32 error 299
      1 [main] bash 1742 child_copy: data read copy failed, 0x4C2000..0x4C68E0, done 4096, windows pid 6816, Win32 error 299
      1 [main] bash 1743 child_copy: data read copy failed, 0x4C2000..0x4C68E0, done 4096, windows pid 14184, Win32 error 299
      0 [main] bash 1744 child_copy: data read copy failed, 0x4C2000..0x4C68E0, done 4096, windows pid 1432, Win32 error 299
      0 [main] bash 1745 child_copy: data read copy failed, 0x4C2000..0x4C68E0, done 4096, windows pid 2560, Win32 error 299
pm3 ~$
pm3 /c/Users/****/Documents/proxmark3$ make clean && make all
bash: make: command not found
pm3 /c/Users/****/Documents/proxmark3$

Last edited by Winds (2020-02-23 14:03:50)

Offline

#8 2020-02-23 14:51:56

gator96100
Contributor
From: Austria
Registered: 2016-03-25
Posts: 153

Re: ProxSpace Bug

You are using the autobuild wrongly. For autobuild to work the you need to git clone the proxmark firmware into a sub-directory. Having the proxmark firmware directly in the pm3 folder will not work. Also make sure you are running ProxSpace as admin.


modhex(hligicighgidilhkfchihtijduhbif)

Offline

#9 2020-02-23 14:59:54

Winds
Banned
Registered: 2020-01-28
Posts: 53

Re: ProxSpace Bug

gator96100 wrote:

You are using the autobuild wrongly. For autobuild to work the you need to git clone the proxmark firmware into a sub-directory. Having the proxmark firmware directly in the pm3 folder will not work. Also make sure you are running ProxSpace as admin.

Yeah me wrong. Sorry.

But compiled client at the "\msys2\builds\" asking me the 'libicuuc65.dll' how it's fix?

That's I have in compiled zip:

hardnested\
lualibs\
platforms\
FLASH - All.bat
FLASH - Bootrom.bat
FLASH - fullimage.bat
Go.bat
libFLAC-8.dll
libgcc_s_dw2-1.dll
libiconv-2.dll
libogg-0.dll
libreadline8.dll
libsndfile-1.dll
libspeex-1.dll
libstdc++-6.dll
libtermcap-0.dll
libvorbis-0.dll
libvorbisenc-2.dll
libwinpthread-1.dll
proxmark3.exe
qt.conf
zlib1.dll

Have no some dlls like a "libicuuc64.dll" etc...

Last edited by Winds (2020-02-23 16:25:54)

Offline

#10 2020-02-23 16:49:52

Winds
Banned
Registered: 2020-01-28
Posts: 53

Re: ProxSpace Bug

PS

These packages is missing

https://packages.msys2.org/package/mingw-w64-i686-icu
https://packages.msys2.org/package/mingw-w64-x86_64-zstd

cp: cannot stat '/mingw32/bin/libicudt64.dll': No such file or directory
cp: cannot stat '/mingw32/bin/libicuin64.dll': No such file or directory
cp: cannot stat '/mingw32/bin/libicuuc64.dll': No such file or directory
cp: cannot stat '/pm3/proxmark3/client/flasher.exe': No such file or directory
cp: cannot stat '/pm3/proxmark3/client/*.dic': No such file or directory
cp: cannot stat '/pm3/proxmark3/client/scripts': No such file or directory

Last edited by Winds (2020-02-23 16:54:31)

Offline

#11 2020-02-23 18:58:32

Winds
Banned
Registered: 2020-01-28
Posts: 53

Re: ProxSpace Bug

I even don't now what to say...

The new laptop, new Windows 10, GitHub Desktop, as admin

Optional dependencies for git
    python2: various helper scripts
    subversion: git svn
      0 [main] bash 2557 child_copy: data read copy failed, 0x4C2000..0x4C68E0, done 4096, windows pid 516, Win32 error 299
/ps/bin/ps-setup: line 1:  2557 Segmentation fault      (core dumped) pacman -Q $1 > /dev/null
      1 [main] bash 2558 child_copy: data read copy failed, 0x4C2000..0x4C68E0, done 4096, windows pid 13768, Win32 error 299
/ps/bin/ps-setup: line 1:  2558 Segmentation fault      (core dumped) pacman -Q $1 > /dev/null
      0 [main] bash 2559 child_copy: data read copy failed, 0x4C2000..0x4C68E0, done 4096, windows pid 9556, Win32 error 299
/ps/bin/ps-setup: line 1:  2559 Segmentation fault      (core dumped) pacman -Q $1 > /dev/null
      0 [main] bash 2560 child_copy: data read copy failed, 0x4C2000..0x4C68E0, done 4096, windows pid 4844, Win32 error 299
/ps/bin/ps-setup: line 13:  2560 Segmentation fault      (core dumped) rm -rf /mingw64/share/qt5/examples
      0 [main] bash 2561 child_copy: data read copy failed, 0x4C2000..0x4C68E0, done 4096, windows pid 17948, Win32 error 299
/ps/bin/ps-setup: line 13:  2561 Segmentation fault      (core dumped) pacman --noconfirm --overwrite='*' -Scc
      0 [main] bash 2562 child_copy: data read copy failed, 0x4C2000..0x4C68E0, done 4096, windows pid 13836, Win32 error 299
      1 [main] bash 2563 child_copy: data read copy failed, 0x4C2000..0x4C68E0, done 4096, windows pid 14100, Win32 error 299
      0 [main] bash 2564 child_copy: data read copy failed, 0x4C2000..0x4C68E0, done 4096, windows pid 2580, Win32 error 299
      0 [main] bash 2565 child_copy: data read copy failed, 0x4C2000..0x4C68E0, done 4096, windows pid 11096, Win32 error 299
      0 [main] bash 2566 child_copy: data read copy failed, 0x4C2000..0x4C68E0, done 4096, windows pid 14452, Win32 error 299

Offline

#12 2020-02-23 20:01:04

gator96100
Contributor
From: Austria
Registered: 2016-03-25
Posts: 153

Re: ProxSpace Bug

Please use the git version that is provided with ProxSpace. The error contains pids, what processes are those? GitHub Desktop could interfear with ProxSpace. Send the output of the ps-info command.


modhex(hligicighgidilhkfchihtijduhbif)

Offline

#13 2020-02-23 20:25:27

Winds
Banned
Registered: 2020-01-28
Posts: 53

Re: ProxSpace Bug

gator96100 wrote:

Please use the git version that is provided with ProxSpace. The error contains pids, what processes are those? GitHub Desktop could interfear with ProxSpace. Send the output of the ps-info command.

ps-info:

 [-b BaseAddress] [-o Offset] [-s DllSuffix] [-T FileList | -] [-4|-8] [-p] [-t] [-i] [-v]
pm3 ~$ ps-info
ProxSpace info:
Version: 3.3
Arch: x86_64
OS: □□□□□□□□□□ Windows 10 Pro              64-ࠧ□來□□  10.0.18363
CPU: Intel(R) Core(TM) i7-9750H CPU @ 2.60GHz
Ram: 16901623808
Installed32:
Installed64: 2020-02-23 21:51:47
OLDPWD: /c/Users/Cue/Documents/GitHub/ProxSpace
Path: /gcc-arm-none-eabi/bin:/ps/bin:/mingw64/bin:/usr/local/bin:/usr/bin:/bin:/c/Windows/System32:/c/Windows:/c/Windows/System32/Wbem:/c/Windows/System32/WindowsPowerShell/v1.0/:/usr/bin/site_perl:/usr/bin/vendor_perl:/usr/bin/core_perl
arm-none-eabi-gcc: 8.3.1
gcc: 9.2.0
git: git version 2.25.1
make: GNU Make 4.3
Built for i686-pc-msys
Copyright (C) 1988-2020 Free Software Foundation, Inc.
License GPLv3+: GNU GPL version 3 or later <http://gnu.org/licenses/gpl.html>
This is free software: you are free to change and redistribute it.
There is NO WARRANTY, to the extent permitted by law.
pkg-config: 0.29.2
Qt: QMake version 3.1
Using Qt version 5.14.1 in C:/Users/Cue/Documents/GitHub/ProxSpace/msys2/mingw64/lib

Offline

#14 2020-02-23 20:32:26

Winds
Banned
Registered: 2020-01-28
Posts: 53

Re: ProxSpace Bug

My steps:

1) git clone https://github.com/Gator96100/ProxSpace.git
2) run runme64.bat
3) I see the pm3 folder
4) cd pm3 folder
5) git clone https://github.com/RfidResearchGroup/proxmark3.git
6) run autobuild.bat
7) got \ProxSpace\msys2\builds\proxmark3-64\proxmark3-64-20200223-cfcb0414590d8dba611e9e1eaf60f52495sd69de.zip with missing dll's as I wrote before

I have installed Git 2.25.1 and GitHub Desktop

Offline

#15 2020-02-24 22:15:39

Winds
Banned
Registered: 2020-01-28
Posts: 53

Re: ProxSpace Bug

I give up! What's going on. Do you can fix? There have no PIDs from console layout at all!

Git 2.25.1 has gone to trash and the result is same:

(36/36) checking keys in keyring                                         [#######################################] 100%
(36/36) checking package integrity                                       [#######################################] 100%
(36/36) loading package files                                            [#######################################] 100%
(36/36) checking for file conflicts                                      [#######################################] 100%
(36/36) checking available disk space                                    [#######################################] 100%
:: Processing package changes...
( 1/36) installing expat                                                 [#######################################] 100%
( 2/36) installing vim                                                   [#######################################] 100%
( 3/36) installing heimdal                                               [#######################################] 100%
( 4/36) installing openssh                                               [#######################################] 100%
( 5/36) installing db                                                    [#######################################] 100%
( 6/36) installing libgdbm                                               [#######################################] 100%
( 7/36) installing gdbm                                                  [#######################################] 100%
( 8/36) upgrading bash                                                   [#######################################] 100%
( 9/36) installing perl                                                  [#######################################] 100%
(10/36) installing perl-Error                                            [#######################################] 100%
(11/36) installing perl-Authen-SASL                                      [#######################################] 100%
(12/36) installing perl-Encode-Locale                                    [#######################################] 100%
(13/36) installing perl-HTTP-Date                                        [#######################################] 100%
(14/36) installing perl-File-Listing                                     [#######################################] 100%
(15/36) installing perl-HTML-Tagset                                      [#######################################] 100%
(16/36) installing perl-HTML-Parser                                      [#######################################] 100%
(17/36) installing perl-LWP-MediaTypes                                   [#######################################] 100%
(18/36) installing perl-URI                                              [#######################################] 100%
(19/36) installing perl-HTTP-Message                                     [#######################################] 100%
(20/36) installing perl-HTTP-Cookies                                     [#######################################] 100%
(21/36) installing perl-HTTP-Daemon                                      [#######################################] 100%
(22/36) installing perl-HTTP-Negotiate                                   [#######################################] 100%
(23/36) installing perl-Net-HTTP                                         [#######################################] 100%
(24/36) installing perl-WWW-RobotRules                                   [#######################################] 100%
(25/36) installing perl-Try-Tiny                                         [#######################################] 100%
(26/36) installing perl-libwww                                           [#######################################] 100%
Optional dependencies for perl-libwww
    perl-LWP-Protocol-https: for https:// url schemes
(27/36) installing perl-TimeDate                                         [#######################################] 100%
(28/36) installing perl-MailTools                                        [#######################################] 100%
(29/36) installing perl-IO-stringy                                       [#######################################] 100%
(30/36) installing perl-Convert-BinHex                                   [#######################################] 100%
module test... pass.
(31/36) installing perl-MIME-tools                                       [#######################################] 100%
(32/36) installing perl-Net-SSLeay                                       [#######################################] 100%
(33/36) installing perl-IO-Socket-SSL                                    [#######################################] 100%
(34/36) installing perl-Net-SMTP-SSL                                     [#######################################] 100%
(35/36) installing perl-TermReadKey                                      [#######################################] 100%
(36/36) installing git                                                   [#######################################] 100%
Optional dependencies for git
    python2: various helper scripts
    subversion: git svn
      0 [main] bash 1416 child_copy: data read copy failed, 0x4C2000..0x4C68E0, done 4096, windows pid 9388, Win32 error 299
/ps/bin/ps-setup: line 1:  1416 Segmentation fault      (core dumped) pacman -Q $1 > /dev/null
      0 [main] bash 1417 child_copy: data read copy failed, 0x4C2000..0x4C68E0, done 4096, windows pid 3132, Win32 error 299
/ps/bin/ps-setup: line 1:  1417 Segmentation fault      (core dumped) pacman -Q $1 > /dev/null
      1 [main] bash 1418 child_copy: data read copy failed, 0x4C2000..0x4C68E0, done 4096, windows pid 6456, Win32 error 299
/ps/bin/ps-setup: line 1:  1418 Segmentation fault      (core dumped) pacman -Q $1 > /dev/null
      1 [main] bash 1419 child_copy: data read copy failed, 0x4C2000..0x4C68E0, done 4096, windows pid 15288, Win32 error 299
/ps/bin/ps-setup: line 13:  1419 Segmentation fault      (core dumped) rm -rf /mingw64/share/qt5/examples
      0 [main] bash 1420 child_copy: data read copy failed, 0x4C2000..0x4C68E0, done 4096, windows pid 17596, Win32 error 299
/ps/bin/ps-setup: line 13:  1420 Segmentation fault      (core dumped) pacman --noconfirm --overwrite='*' -Scc
      0 [main] bash 1421 child_copy: data read copy failed, 0x4C2000..0x4C68E0, done 4096, windows pid 11364, Win32 error 299
      0 [main] bash 1422 child_copy: data read copy failed, 0x4C2000..0x4C68E0, done 4096, windows pid 18260, Win32 error 299
      0 [main] bash 1423 child_copy: data read copy failed, 0x4C2000..0x4C68E0, done 4096, windows pid 14476, Win32 error 299
      0 [main] bash 1424 child_copy: data read copy failed, 0x4C2000..0x4C68E0, done 4096, windows pid 7432, Win32 error 299
      1 [main] bash 1425 child_copy: data read copy failed, 0x4C2000..0x4C68E0, done 4096, windows pid 8588, Win32 error 299
pm3 ~$

Last edited by Winds (2020-02-24 22:17:30)

Offline

#16 2020-02-25 02:12:58

gator96100
Contributor
From: Austria
Registered: 2016-03-25
Posts: 153

Re: ProxSpace Bug

gator96100 wrote:

The error contains pids, what processes are those?

What are you running Processes and their pids?
Please do not use git to clone ProxSpace, download the zip from GitHub.
The missing dlls have todo with an outdated autobuild script, simply copy the dlls from ProxSpace.

Last edited by gator96100 (2020-02-25 02:15:17)


modhex(hligicighgidilhkfchihtijduhbif)

Offline

#17 2020-02-25 10:52:29

Winds
Banned
Registered: 2020-01-28
Posts: 53

Re: ProxSpace Bug

gator96100 wrote:
gator96100 wrote:

The error contains pids, what processes are those?

What are you running Processes and their pids?
Please do not use git to clone ProxSpace, download the zip from GitHub.
The missing dlls have todo with an outdated autobuild script, simply copy the dlls from ProxSpace.

Downloading a ZIP had help with my error.
Why at the compiled ZIP package have no dll's for launch proxmark3.exe? Also me not see needed directories 'dictionaries', 'luascripts' etc.
Yeah I can do all by hands, but If you are doing some space for compiling, please do not be afraid to polish it.
Many Thanks.

Offline

#18 2020-02-25 10:58:34

mwalker
Moderator
Registered: 2019-05-11
Posts: 305

Re: ProxSpace Bug

@winds, fyi the dictionaries are getting updated all the time.  If you want to have the latest, its good to know how to get them by hand.
The code base is also being updated all the time and people like gator96100 have done a great job making things easier for us.  So think about it as an ongoing project rather then a finished one.

Cheers

Offline

#19 2020-02-25 11:52:24

Winds
Banned
Registered: 2020-01-28
Posts: 53

Re: ProxSpace Bug

mwalker wrote:

@winds, fyi the dictionaries are getting updated all the time.  If you want to have the latest, its good to know how to get them by hand.
The code base is also being updated all the time and people like gator96100 have done a great job making things easier for us.  So think about it as an ongoing project rather then a finished one.

Cheers

The Build package is it ready to use package? No? Yes.
Why at the Gator 96100 the same ZIP builds including all of these things and my not?

But could you please fix it?

Add a missing dll's:

cp $mingwDir/bin/{libbz2-1.dll,libdouble-conversion.dll,libfreetype-*.dll,libgcc_s_*.dll,libglib-2.0-0.dll,libgraphite2.dll,libharfbuzz-0.dll,libiconv-2.dll,libicudt64.dll,libicuin64.dll,libicuuc64.dll,libintl-8.dll,libpcre-1.dll,libpcre2-16-0.dll,libpng16-16.dll,libreadline*.dll,libstdc++-*.dll,libtermcap-0.dll,libwinpthread-1.dll,Qt5Core.dll,Qt5Gui.dll,Qt5Widgets.dll,zlib1.dll,libsndfile-1.dll,libFLAC-8.dll,libogg-0.dll,libspeex-1.dll,libvorbis-0.dll,libvorbisenc-2.dll} $buildDir/${i%%/}/win$arch

Last edited by Winds (2020-02-25 11:57:35)

Offline

#20 2020-02-25 11:58:29

gator96100
Contributor
From: Austria
Registered: 2016-03-25
Posts: 153

Re: ProxSpace Bug

I have older packages installed on my ProxSpace environment. Updating the autobuild script is on my todo list.


modhex(hligicighgidilhkfchihtijduhbif)

Offline

#21 2020-02-25 12:11:59

Winds
Banned
Registered: 2020-01-28
Posts: 53

Re: ProxSpace Bug

gator96100 wrote:

I have older packages installed on my ProxSpace environment. Updating the autobuild script is on my todo list.

Gator96100 you can copy paste this code to autobuild.sh and disput these from your should task list:

#!/bin/bash
pm3Dir=/pm3
copyDir=/builds
buildDir=/tmp

pacman -Q zip 1>/dev/null
if [[ $? != 0 ]]; then
	pacman --noconfirm -S zip
fi

if [ "$MSYSTEM" == "MINGW32" ]; then
	mingwDir=/mingw32
	arch=32
fi

if [ "$MSYSTEM" == "MINGW64" ]; then
	mingwDir=/mingw64
	arch=64
fi

cd $pm3Dir
for i in $(ls -d */); do
	echo Processing: ${i%%/}-$arch
	cd $pm3Dir/${i%%/}
	git fetch
	git pull
	hash=$(git rev-parse HEAD)
	date=$(date +%Y%m%d)
	if ! ls $copyDir/${i%%/}-$arch/*-$hash.zip 1>/dev/null 2>&1; then
		make clean
		make all
		if [ $? -eq 0 ]; then
			rm -rf $buildDir/${i%%/}/*
			mkdir -p $copyDir/${i%%/}-$arch/
			mkdir -p $buildDir/${i%%/}/win$arch/platforms
			mkdir -p $buildDir/${i%%/}/firmware_win/bootrom
			mkdir -p "$buildDir/${i%%/}/firmware_win/JTAG Only"
			mkdir -p "$buildDir/${i%%/}/Windows Driver"
			#you have to thank QT5 for all that dlls
			cp $mingwDir/bin/{libbz2-1.dll,libdouble-conversion.dll,libfreetype-*.dll,libgcc_s_*.dll,libglib-2.0-0.dll,libgraphite2.dll,libharfbuzz-0.dll,libiconv-2.dll,libicudt65.dll,libicuin65.dll,libzstd.dll,libicuuc65.dll,libintl-8.dll,libpcre-1.dll,libpcre2-16-0.dll,libpng16-16.dll,libreadline*.dll,libstdc++-*.dll,libtermcap-0.dll,libwinpthread-1.dll,Qt5Core.dll,Qt5Gui.dll,Qt5Widgets.dll,zlib1.dll,libsndfile-1.dll,libFLAC-8.dll,libogg-0.dll,libspeex-1.dll,libvorbis-0.dll,libvorbisenc-2.dll} $buildDir/${i%%/}/win$arch
			cp -r /ps/autobuild/* $buildDir/${i%%/}/win$arch
			cp -r $pm3Dir/${i%%/}/client/{proxmark3.exe,flasher.exe,*.bin,*.eml,*.html,*.json,lualibs,dictionaries,luascripts,hardnested} $buildDir/${i%%/}/win$arch
			cp $mingwDir/share/qt5/plugins/platforms/qwindows.dll $buildDir/${i%%/}/win$arch/platforms
			cp $pm3Dir/${i%%/}/armsrc/obj/{fullimage.elf,fullimage.s19} $buildDir/${i%%/}/firmware_win
			cp $pm3Dir/${i%%/}/bootrom/obj/{bootrom.elf,bootrom.s19} $buildDir/${i%%/}/firmware_win/bootrom
			cp $pm3Dir/${i%%/}/recovery/{bootrom.bin,fullimage.bin,proxmark3_recovery.bin} "$buildDir/${i%%/}/firmware_win/JTAG Only"
			cp $pm3Dir/${i%%/}/driver/proxmark3.inf "$buildDir/${i%%/}/Windows Driver"
			rm $buildDir/${i%%/}/win$arch/hardnested/{*.h,*.c}
			cd $buildDir/${i%%/}
			zip -r $copyDir/${i%%/}-$arch/${i%%/}-$arch-$date-$hash.zip ./*
			echo done
		fi
	fi
done

Regards

Last edited by Winds (2020-02-25 13:21:07)

Offline

#22 2020-02-25 13:04:25

Winds
Banned
Registered: 2020-01-28
Posts: 53

Re: ProxSpace Bug

*UPD: fix folder from 'scripts' to 'luascripts'
*UPD: *.dic to 'dictionaries'

For me looks great

Last edited by Winds (2020-02-25 13:21:58)

Offline

Board footer

Powered by FluxBB